Reaction Details
TargetCarbonic anhydrase 1
LigandBDBM26188
Substrate/Competitorn/a
Meas. Tech.ChEMBL_1526373 (CHEMBL3637534)
Ki 4003000±n/a nM
Citation Isik, SVullo, DDurdagi, SEkinci, DSentürk, MÇetin, ASentürk, ESupuran, CT Interaction of carbonic anhydrase isozymes I, II, and IX with some pyridine and phenol hydrazinecarbothioamide derivatives. Bioorg Med Chem Lett25:5636-41 (2015) 
 
Carbonic anhydrase 1
Name:Carbonic anhydrase 1
Type:Enzyme
Mol. Mass.:28873.37
Organism:Homo sapiens (Human)
Description:P00915
Residue:261
BDBM26188
NameBDBM26188
Synonyms:α-CA inhibitor, 12 1,2-dihydroxybenzene benzene-1,2-diol | phenol derivative, 2
TypeSmall organic molecule
Emp. Form.C6H6O2
Mol. Mass.110.1106
SMILESOc1ccccc1O