Reaction Details
TargetOrexin/Hypocretin receptor type 1
LigandBDBM123398
Substrate/Competitorn/a
Meas. Tech.ChEMBL_1526534 (CHEMBL3635422)
Ki 109±n/a nM
Citation Behnke, DCotesta, SHintermann, SFendt, MGee, CEJacobson, LHLaue, GMeyer, AWagner, TBadiger, SChaudhari, VChebrolu, MPandit, CHoyer, DBetschart, C Discovery of 1H-pyrazolo[3,4-b]pyridines as potent dual orexin receptor antagonists (DORAs). Bioorg Med Chem Lett25:5555-60 (2015) 
 
Orexin/Hypocretin receptor type 1
Name:Orexin/Hypocretin receptor type 1
Type:Protein
Mol. Mass.:47554.50
Organism:Homo sapiens (Human)
Description:O43613
Residue:425
BDBM123398
NameBDBM123398
Synonyms:US8742106, 6.63
TypeSmall organic molecule
Emp. Form.C22H25N5O2
Mol. Mass.391.4662
SMILESCc1ccc2[C@H](CCc2n1)NC(=O)COc1cc(C)c2c(nn(C)c2n1)C1CC1