Reaction Details
TargetOrexin/Hypocretin receptor type 1
LigandBDBM50133877
Substrate/Competitorn/a
Meas. Tech.ChEMBL_1526534 (CHEMBL3635422)
Ki 783±n/a nM
Citation Behnke, DCotesta, SHintermann, SFendt, MGee, CEJacobson, LHLaue, GMeyer, AWagner, TBadiger, SChaudhari, VChebrolu, MPandit, CHoyer, DBetschart, C Discovery of 1H-pyrazolo[3,4-b]pyridines as potent dual orexin receptor antagonists (DORAs). Bioorg Med Chem Lett25:5555-60 (2015) 
 
Orexin/Hypocretin receptor type 1
Name:Orexin/Hypocretin receptor type 1
Type:Protein
Mol. Mass.:47554.50
Organism:Homo sapiens (Human)
Description:O43613
Residue:425
BDBM50133877
NameBDBM50133877
Synonyms:CHEMBL3634027
TypeSmall organic molecule
Emp. Form.C22H25N5O2
Mol. Mass.391.4662
SMILESCc1cc2CC[C@H](NC(=O)COc3cc(C)c4c(nn(C)c4n3)C3CC3)c2cn1