Reaction Details
TargetOrexin receptor type 2
LigandBDBM50133872
Substrate/Competitorn/a
Meas. Tech.ChEMBL_1526535 (CHEMBL3635423)
Ki>2000±n/a nM
Citation Behnke, DCotesta, SHintermann, SFendt, MGee, CEJacobson, LHLaue, GMeyer, AWagner, TBadiger, SChaudhari, VChebrolu, MPandit, CHoyer, DBetschart, C Discovery of 1H-pyrazolo[3,4-b]pyridines as potent dual orexin receptor antagonists (DORAs). Bioorg Med Chem Lett25:5555-60 (2015) 
 
Orexin receptor type 2
Name:Orexin receptor type 2
Type:Protein
Mol. Mass.:50710.53
Organism:Homo sapiens (Human)
Description:O43614
Residue:444
BDBM50133872
NameBDBM50133872
Synonyms:CHEMBL3634016
TypeSmall organic molecule
Emp. Form.C23H23F3N6O2
Mol. Mass.472.4629
SMILESC[C@@H](NC(=O)COc1cc(c2c(nn(C)c2n1)-c1ccccc1)C(F)(F)F)c1c(C)n[nH]c1C