Reaction Details
TargetOrexin receptor type 2
LigandBDBM123358
Substrate/Competitorn/a
Meas. Tech.ChEMBL_1526535 (CHEMBL3635423)
Ki 15±n/a nM
Citation Behnke, DCotesta, SHintermann, SFendt, MGee, CEJacobson, LHLaue, GMeyer, AWagner, TBadiger, SChaudhari, VChebrolu, MPandit, CHoyer, DBetschart, C Discovery of 1H-pyrazolo[3,4-b]pyridines as potent dual orexin receptor antagonists (DORAs). Bioorg Med Chem Lett25:5555-60 (2015) 
 
Orexin receptor type 2
Name:Orexin receptor type 2
Type:Protein
Mol. Mass.:50710.53
Organism:Homo sapiens (Human)
Description:O43614
Residue:444
BDBM123358
NameBDBM123358
Synonyms:US8742106, 4.8
TypeSmall organic molecule
Emp. Form.C23H24N6O2
Mol. Mass.416.4757
SMILESC[C@H](NC(=O)COc1cc(C)c2c(nn(C)c2n1)-c1cnccn1)c1ccc(C)cc1