Reaction Details
TargetOrexin receptor type 2
LigandBDBM50133880
Substrate/Competitorn/a
Meas. Tech.ChEMBL_1526535 (CHEMBL3635423)
Ki 59±n/a nM
Citation Behnke, DCotesta, SHintermann, SFendt, MGee, CEJacobson, LHLaue, GMeyer, AWagner, TBadiger, SChaudhari, VChebrolu, MPandit, CHoyer, DBetschart, C Discovery of 1H-pyrazolo[3,4-b]pyridines as potent dual orexin receptor antagonists (DORAs). Bioorg Med Chem Lett25:5555-60 (2015) 
 
Orexin receptor type 2
Name:Orexin receptor type 2
Type:Protein
Mol. Mass.:50710.53
Organism:Homo sapiens (Human)
Description:O43614
Residue:444
BDBM50133880
NameBDBM50133880
Synonyms:CHEMBL3634028
TypeSmall organic molecule
Emp. Form.C24H26F2N6O2
Mol. Mass.468.499
SMILESCC(NC(=O)COc1cc(C(F)F)c2c(nn(C)c2n1)-c1ccccc1)c1c(C)nn(C)c1C