Reaction Details
TargetOrexin receptor type 2
LigandBDBM123325
Substrate/Competitorn/a
Meas. Tech.ChEMBL_1526538 (CHEMBL3635614)
Ki 4.0±n/a nM
Citation Behnke, DCotesta, SHintermann, SFendt, MGee, CEJacobson, LHLaue, GMeyer, AWagner, TBadiger, SChaudhari, VChebrolu, MPandit, CHoyer, DBetschart, C Discovery of 1H-pyrazolo[3,4-b]pyridines as potent dual orexin receptor antagonists (DORAs). Bioorg Med Chem Lett25:5555-60 (2015) 
 
Orexin receptor type 2
Name:Orexin receptor type 2
Type:Protein
Mol. Mass.:50710.53
Organism:Homo sapiens (Human)
Description:O43614
Residue:444
BDBM123325
NameBDBM123325
Synonyms:US8742106, 1.4
TypeSmall organic molecule
Emp. Form.C25H23F3N4O3
Mol. Mass.484.4703
SMILESCOc1ccc(cc1)[C@H](C)NC(=O)COc1cc(c2c(nn(C)c2n1)-c1ccccc1)C(F)(F)F