Reaction Details
TargetMu-type opioid receptor
LigandBDBM50133892
Substrate/Competitorn/a
Meas. Tech.ChEMBL_1526571 (CHEMBL3635647)
Ki 0.050000±n/a nM
Citation Harland, AAYeomans, LGriggs, NWAnand, JPPogozheva, IDJutkiewicz, EMTraynor, JRMosberg, HI Further Optimization and Evaluation of Bioavailable, Mixed-Efficacyµ-Opioid Receptor (MOR) Agonists/d-Opioid Receptor (DOR) Antagonists: Balancing MOR and DOR Affinities. J Med Chem58:8952-69 (2015) 
 
Mu-type opioid receptor
Name:Mu-type opioid receptor
Type:G Protein-Coupled Receptor (GPCR)
Mol. Mass.:44503.11
Organism:Rattus norvegicus (rat)
Description:Competition binding assays were carried out using membrane preparations from transfected HN9.10 cells that constitutively expressed the mu opioid receptor.
Residue:398
BDBM50133892
NameBDBM50133892
Synonyms:CHEMBL3634256
TypeSmall organic molecule
Emp. Form.C32H37N3O3
Mol. Mass.511.6545
SMILESCC(=O)N1CC[C@@H](NC(=O)[C@@H](N)Cc2c(C)cc(O)cc2C)c2cc(CC3Cc4ccccc4C3)ccc12