Reaction Details
TargetDNA gyrase subunit B
LigandBDBM50135114
Substrate/Competitorn/a
Meas. Tech.ChEMBL_1542254 (CHEMBL3745476)
IC50<8±n/a nM
Citation Zhang, JYang, QRomero, JACross, JWang, BPoutsiaka, KMEpie, FBevan, DWu, YMoy, TDaniel, AChamberlain, BCarter, NShotwell, JArya, AKumar, VSilverman, JNguyen, KMetcalf, CARyan, DLippa, BDolle, RE Discovery of Indazole Derivatives as a Novel Class of Bacterial Gyrase B Inhibitors. ACS Med Chem Lett6:1080-5 (2015) 
 
DNA gyrase subunit B
Name:DNA gyrase subunit B
Type:Enzyme Subunit
Mol. Mass.:72530.91
Organism:Staphylococcus aureus
Description:n/a
Residue:644
BDBM50135114
NameBDBM50135114
Synonyms:CHEMBL3742072
TypeSmall organic molecule
Emp. Form.C18H16N5Na2O5PS
Mol. Mass.491.368
SMILES[Na+].[Na+].CCCOc1nccc2c(n[nH]c12)-c1cnc(s1)-c1ccc(COP([O-])([O-])=O)nc1