Reaction Details
TargetPeroxisome proliferator-activated receptor delta
LigandBDBM50415440
Substrate/Competitorn/a
Meas. Tech.ChEMBL_1541986 (CHEMBL3743872)
IC50 1.2±n/a nM
Citation Kaupang, ÅKase, ETVo, CXAmundsen, MVik, AHansen, TV Synthesis of 5-trifluoromethyl-2-sulfonylpyridine PPARß/d antagonists: Effects on the affinity and selectivity towards PPARß/d. Bioorg Med Chem24:247-60 (2016) 
 
Peroxisome proliferator-activated receptor delta
Name:Peroxisome proliferator-activated receptor delta
Type:Enzyme
Mol. Mass.:49910.45
Organism:Homo sapiens (Human)
Description:Q03181
Residue:441
BDBM50415440
NameBDBM50415440
Synonyms:CHEMBL598608 | GSK-3787
TypeSmall organic molecule
Emp. Form.C15H12ClF3N2O3S
Mol. Mass.392.781
SMILESFC(F)(F)c1ccc(nc1)S(=O)(=O)CCNC(=O)c1ccc(Cl)cc1