Reaction Details
TargetCarbonic anhydrase, alpha family
LigandBDBM50013792
Substrate/Competitorn/a
Meas. Tech.ChEMBL_1543854 (CHEMBL3749744)
Ki 27±n/a nM
Citation Vullo, DBhatt, AMahon, BPMcKenna, RSupuran, CT Sulfonamide inhibition studies of thea-carbonic anhydrase from the gammaproteobacterium Thiomicrospira crunogena XCL-2, TcruCA. Bioorg Med Chem Lett26:401-5 (2016) 
 
Carbonic anhydrase, alpha family
Name:Carbonic anhydrase, alpha family
Synonyms:Carbonic anhydrase, alpha family
Type:PROTEIN
Mol. Mass.:35831.01
Organism:Thiomicrospira crunogena (strain XCL-2)
Description:ChEMBL_109899
Residue:315
BDBM50013792
NameBDBM50013792
TypeSmall organic molecule
Emp. Form.C5H8N4O3S2
Mol. Mass.236.272
SMILESCC(=O)\N=c1\sc(nn1C)S(N)(=O)=O