Reaction Details
TargetCarbonic anhydrase, alpha family
LigandBDBM10884
Substrate/Competitorn/a
Meas. Tech.ChEMBL_1543854 (CHEMBL3749744)
Ki 7.0±n/a nM
Citation Vullo, DBhatt, AMahon, BPMcKenna, RSupuran, CT Sulfonamide inhibition studies of thea-carbonic anhydrase from the gammaproteobacterium Thiomicrospira crunogena XCL-2, TcruCA. Bioorg Med Chem Lett26:401-5 (2016) 
 
Carbonic anhydrase, alpha family
Name:Carbonic anhydrase, alpha family
Synonyms:Carbonic anhydrase, alpha family
Type:PROTEIN
Mol. Mass.:35831.01
Organism:Thiomicrospira crunogena (strain XCL-2)
Description:ChEMBL_109899
Residue:315
BDBM10884
NameBDBM10884
TypeSmall organic molecule
Emp. Form.C10H16N2O4S3
Mol. Mass.324.44
SMILESCCN[C@H]1C[C@H](C)S(=O)(=O)c2sc(cc12)S(N)(=O)=O