Reaction Details
TargetMitogen-activated protein kinase 8
LigandBDBM15997
Substrate/Competitorn/a
Meas. Tech.ChEMBL_1544313 (CHEMBL3751430)
IC50 28±n/a nM
Citation Simon-Szabó, LKokas, MGreff, ZBoros, SBánhegyi, PZsákai, LSzántai-Kis, CVantus, TMandl, JBánhegyi, GVályi-Nagy, IOrfi, LUllrich, ACsala, MKéri, G Novel compounds reducing IRS-1 serine phosphorylation for treatment of diabetes. Bioorg Med Chem Lett26:424-8 (2016) 
 
Mitogen-activated protein kinase 8
Name:Mitogen-activated protein kinase 8
Type:Enzyme
Mol. Mass.:48297.57
Organism:Homo sapiens (Human)
Description:JNK-1 was purchased from Upstate Cell Signaling Solutions (formerly Upstate Biotechnology).
Residue:427
BDBM15997
NameBDBM15997
Synonyms:2-({2-[(3-fluorophenyl)amino]pyrimidin-4-yl}amino)benzoic acid | 4-anilinopyrimidine 8f
TypeSmall organic molecule
Emp. Form.C17H13FN4O2
Mol. Mass.324.3091
SMILESOC(=O)c1ccccc1Nc1ccnc(Nc2cccc(F)c2)n1