Reaction Details
TargetMitogen-activated protein kinase 8
LigandBDBM50134592
Substrate/Competitorn/a
Meas. Tech.ChEMBL_1544314 (CHEMBL3751431)
IC50 2750±n/a nM
Citation Simon-Szabó, LKokas, MGreff, ZBoros, SBánhegyi, PZsákai, LSzántai-Kis, CVantus, TMandl, JBánhegyi, GVályi-Nagy, IOrfi, LUllrich, ACsala, MKéri, G Novel compounds reducing IRS-1 serine phosphorylation for treatment of diabetes. Bioorg Med Chem Lett26:424-8 (2016) 
 
Mitogen-activated protein kinase 8
Name:Mitogen-activated protein kinase 8
Type:Enzyme
Mol. Mass.:48297.57
Organism:Homo sapiens (Human)
Description:JNK-1 was purchased from Upstate Cell Signaling Solutions (formerly Upstate Biotechnology).
Residue:427
BDBM50134592
NameBDBM50134592
Synonyms:CHEMBL3746673
TypeSmall organic molecule
Emp. Form.C22H23F2N5O4
Mol. Mass.459.4459
SMILESCCOC(=O)N1CCC(CC1)Nc1ncc2cc(Oc3ccc(F)cc3F)c(=O)n(C)c2n1