Reaction Details
TargetMitogen-activated protein kinase 8
LigandBDBM50134601
Substrate/Competitorn/a
Meas. Tech.ChEMBL_1544314 (CHEMBL3751431)
IC50 2770±n/a nM
Citation Simon-Szabó, LKokas, MGreff, ZBoros, SBánhegyi, PZsákai, LSzántai-Kis, CVantus, TMandl, JBánhegyi, GVályi-Nagy, IOrfi, LUllrich, ACsala, MKéri, G Novel compounds reducing IRS-1 serine phosphorylation for treatment of diabetes. Bioorg Med Chem Lett26:424-8 (2016) 
 
Mitogen-activated protein kinase 8
Name:Mitogen-activated protein kinase 8
Type:Enzyme
Mol. Mass.:48297.57
Organism:Homo sapiens (Human)
Description:JNK-1 was purchased from Upstate Cell Signaling Solutions (formerly Upstate Biotechnology).
Residue:427
BDBM50134601
NameBDBM50134601
Synonyms:CHEMBL3746889
TypeSmall organic molecule
Emp. Form.C18H19F2N5O4S
Mol. Mass.439.436
SMILESCn1c2nc(NCCCNS(C)(=O)=O)ncc2cc(Oc2ccc(F)cc2F)c1=O