Reaction Details
TargetMitogen-activated protein kinase 8
LigandBDBM50134603
Substrate/Competitorn/a
Meas. Tech.ChEMBL_1544314 (CHEMBL3751431)
IC50 3340±n/a nM
Citation Simon-Szabó, LKokas, MGreff, ZBoros, SBánhegyi, PZsákai, LSzántai-Kis, CVantus, TMandl, JBánhegyi, GVályi-Nagy, IOrfi, LUllrich, ACsala, MKéri, G Novel compounds reducing IRS-1 serine phosphorylation for treatment of diabetes. Bioorg Med Chem Lett26:424-8 (2016) 
 
Mitogen-activated protein kinase 8
Name:Mitogen-activated protein kinase 8
Type:Enzyme
Mol. Mass.:48297.57
Organism:Homo sapiens (Human)
Description:JNK-1 was purchased from Upstate Cell Signaling Solutions (formerly Upstate Biotechnology).
Residue:427
BDBM50134603
NameBDBM50134603
Synonyms:CHEMBL3745734
TypeSmall organic molecule
Emp. Form.C25H24F2N6O2
Mol. Mass.478.4939
SMILESCN1CCN(CC1)c1ccc(Nc2ncc3cc(Oc4ccc(F)cc4F)c(=O)n(C)c3n2)cc1