Reaction Details
TargetGlycylpeptide N-tetradecanoyltransferase 1
LigandBDBM50135531
Substrate/Competitorn/a
Meas. Tech.ChEMBL_1549624 (CHEMBL3756684)
Ki 360±n/a nM
Citation Yu, ZBrannigan, JARangachari, KHeal, WPWilkinson, AJHolder, AALeatherbarrow, RJTate, EW Discovery of pyridyl-based inhibitors of Plasmodium falciparum N-myristoyltransferase. Medchemcomm6:1767-1772 (2016) Glycylpeptide N-tetradecanoyltransferase 1
Name:Glycylpeptide N-tetradecanoyltransferase 1
Type:Enzyme
Mol. Mass.:56814.10
Organism:Homo sapiens (Human)
Description:P30419
Residue:496
BDBM50135531
NameBDBM50135531
Synonyms:CHEMBL3753053
TypeSmall organic molecule
Emp. Form.C21H22ClN3O3
Mol. Mass.399.871
SMILESCOc1cccc(Cc2noc(n2)-c2ccc(Cl)cc2OC2CCNCC2)c1