Reaction Details
TargetGlycylpeptide N-tetradecanoyltransferase 1
LigandBDBM50135530
Substrate/Competitorn/a
Meas. Tech.ChEMBL_1549624 (CHEMBL3756684)
Ki 200±n/a nM
Citation Yu, ZBrannigan, JARangachari, KHeal, WPWilkinson, AJHolder, AALeatherbarrow, RJTate, EW Discovery of pyridyl-based inhibitors of Plasmodium falciparum N-myristoyltransferase. Medchemcomm6:1767-1772 (2016) Glycylpeptide N-tetradecanoyltransferase 1
Name:Glycylpeptide N-tetradecanoyltransferase 1
Type:Enzyme
Mol. Mass.:56814.10
Organism:Homo sapiens (Human)
Description:P30419
Residue:496
BDBM50135530
NameBDBM50135530
Synonyms:CHEMBL3752766
TypeSmall organic molecule
Emp. Form.C19H24N6O2
Mol. Mass.368.4329
SMILESCc1nn(C)c(C)c1Cc1noc(n1)-c1cccnc1OC1CCNCC1