Reaction Details
TargetSuppressor of tumorigenicity 14 protein homolog
LigandBDBM50135274
Substrate/Competitorn/a
Meas. Tech.ChEMBL_1544368 (CHEMBL3748444)
Ki 227±n/a nM
Citation Kwon, HKim, YPark, KChoi, SASon, SHByun, Y Structure-based design, synthesis, and biological evaluation of Leu-Arg dipeptide analogs as novel hepsin inhibitors. Bioorg Med Chem Lett26:310-4 (2016) 
 
Suppressor of tumorigenicity 14 protein homolog
Name:Suppressor of tumorigenicity 14 protein homolog
Type:PROTEIN
Mol. Mass.:94658.46
Organism:Mus musculus
Description:ChEMBL_116697
Residue:855
BDBM50135274
NameBDBM50135274
Synonyms:CHEMBL404190
TypeSmall organic molecule
Emp. Form.C21H30N6O3S
Mol. Mass.446.566
SMILES[#6]-[#6](-[#6])-[#6]-[#6@H](-[#7]-[#6](-[#6])=O)-[#6](=O)-[#7]-[#6@@H](-[#6]-[#6]-[#6]\[#7]=[#6](\[#7])-[#7])-[#6](=O)-c1nc2ccccc2s1