Reaction Details
TargetProtein kinase C theta type
LigandBDBM50135286
Substrate/Competitorn/a
Meas. Tech.ChEMBL_1543406 (CHEMBL3750010)
IC50>10000±n/a nM
Citation Reddy, MVAkula, BJatiani, SVasquez-Del Carpio, RBilla, VKMallireddigari, MRCosenza, SCVenkata Subbaiah, DRBharathi, EVPallela, VRRamkumar, PJain, RAggarwal, AKReddy, EP Discovery of 2-(1H-indol-5-ylamino)-6-(2,4-difluorophenylsulfonyl)-8-methylpyrido[2,3-d]pyrimidin-7(8H)-one (7ao) as a potent selective inhibitor of Polo like kinase 2 (PLK2). Bioorg Med Chem24:521-44 (2016) 
 
Protein kinase C theta type
Name:Protein kinase C theta type
Type:Serine/threonine-protein kinase
Mol. Mass.:81878.04
Organism:Homo sapiens (Human)
Description:Full-length human PKC theta (Panvera Catalog No. P2996).
Residue:706
BDBM50135286
NameBDBM50135286
Synonyms:CHEMBL3745885
TypeSmall organic molecule
Emp. Form.C22H15F2N5O3S
Mol. Mass.467.448
SMILESCn1c2nc(Nc3ccc4[nH]ccc4c3)ncc2cc(c1=O)S(=O)(=O)c1ccc(F)cc1F