Reaction Details
TargetHistamine H1 receptor
LigandBDBM50137638
Substrate/Competitorn/a
Meas. Tech.ChEMBL_1549480 (CHEMBL3755806)
Ki 1175±n/a nM
Citation Hammer, SGGobleder, SNaporra, FWittmann, HJElz, SHeinrich, MRStrasser, A 2,4-Diaminopyrimidines as dual ligands at the histamine H1 and H4 receptor-H1/H4-receptor selectivity. Bioorg Med Chem Lett26:292-300 (2016) 
 
Histamine H1 receptor
Name:Histamine H1 receptor
Type:G Protein-Coupled Receptor (GPCR)
Mol. Mass.:55808.72
Organism:Homo sapiens (Human)
Description:Cell pellets from SK-N-MC cells transfected with human H1 receptor were used in binding assay.
Residue:487
BDBM50137638
NameBDBM50137638
Synonyms:CHEMBL3753705
TypeSmall organic molecule
Emp. Form.C22H30N6
Mol. Mass.378.5138
SMILESCN1CCN(CC1)c1nc2CCc3ccccc3-c2c(n1)N1CCN(C)CC1