Reaction Details
TargetHistamine H1 receptor
LigandBDBM50137647
Substrate/Competitorn/a
Meas. Tech.ChEMBL_1549480 (CHEMBL3755806)
Ki 1122±n/a nM
Citation Hammer, SGGobleder, SNaporra, FWittmann, HJElz, SHeinrich, MRStrasser, A 2,4-Diaminopyrimidines as dual ligands at the histamine H1 and H4 receptor-H1/H4-receptor selectivity. Bioorg Med Chem Lett26:292-300 (2016) 
 
Histamine H1 receptor
Name:Histamine H1 receptor
Type:G Protein-Coupled Receptor (GPCR)
Mol. Mass.:55808.72
Organism:Homo sapiens (Human)
Description:Cell pellets from SK-N-MC cells transfected with human H1 receptor were used in binding assay.
Residue:487
BDBM50137647
NameBDBM50137647
Synonyms:CHEMBL3752085
TypeSmall organic molecule
Emp. Form.C22H25N5
Mol. Mass.359.4674
SMILESCN1CCN(CC1)c1cc(nc(NCc2ccccc2)n1)-c1ccccc1