Reaction Details
TargetHistamine H1 receptor
LigandBDBM50137648
Substrate/Competitorn/a
Meas. Tech.ChEMBL_1549480 (CHEMBL3755806)
Ki 6310±n/a nM
Citation Hammer, SGGobleder, SNaporra, FWittmann, HJElz, SHeinrich, MRStrasser, A 2,4-Diaminopyrimidines as dual ligands at the histamine H1 and H4 receptor-H1/H4-receptor selectivity. Bioorg Med Chem Lett26:292-300 (2016) 
 
Histamine H1 receptor
Name:Histamine H1 receptor
Type:G Protein-Coupled Receptor (GPCR)
Mol. Mass.:55808.72
Organism:Homo sapiens (Human)
Description:Cell pellets from SK-N-MC cells transfected with human H1 receptor were used in binding assay.
Residue:487
BDBM50137648
NameBDBM50137648
Synonyms:CHEMBL3753784
TypeSmall organic molecule
Emp. Form.C31H32ClN5O
Mol. Mass.526.072
SMILESCOc1ccc(CNc2nc(nc-3c2CCc2ccccc-32)N2CCN(C)CC2)cc1-c1ccc(Cl)cc1