Reaction Details
TargetHistamine H1 receptor
LigandBDBM50137653
Substrate/Competitorn/a
Meas. Tech.ChEMBL_1549480 (CHEMBL3755806)
Ki 1950±n/a nM
Citation Hammer, SGGobleder, SNaporra, FWittmann, HJElz, SHeinrich, MRStrasser, A 2,4-Diaminopyrimidines as dual ligands at the histamine H1 and H4 receptor-H1/H4-receptor selectivity. Bioorg Med Chem Lett26:292-300 (2016) 
 
Histamine H1 receptor
Name:Histamine H1 receptor
Type:G Protein-Coupled Receptor (GPCR)
Mol. Mass.:55808.72
Organism:Homo sapiens (Human)
Description:Cell pellets from SK-N-MC cells transfected with human H1 receptor were used in binding assay.
Residue:487
BDBM50137653
NameBDBM50137653
Synonyms:CHEMBL3753334
TypeSmall organic molecule
Emp. Form.C24H26FN5
Mol. Mass.403.4951
SMILESCN1CCN(CC1)c1nc(NCc2ccc(F)cc2)nc-2c1CCc1ccccc-21