Reaction Details
TargetThermolysin
LigandBDBM50138798
Substrate/Competitorn/a
Meas. Tech.ChEMBL_1550092 (CHEMBL3756038)
IC50 29000±n/a nM
Citation Sjøli, SNuti, ECamodeca, CBilto, IRossello, AWinberg, JOSylte, IAdekoya, OA Synthesis, experimental evaluation and molecular modelling of hydroxamate derivatives as zinc metalloproteinase inhibitors. Eur J Med Chem108:141-53 (2016) 
 
Thermolysin
Name:Thermolysin
Type:PROTEIN
Mol. Mass.:60097.54
Organism:Bacillus thermoproteolyticus
Description:ChEMBL_1468794
Residue:548
BDBM50138798
NameBDBM50138798
Synonyms:CHEMBL3754100
TypeSmall organic molecule
Emp. Form.C9H13BrN2O5S2
Mol. Mass.373.244
SMILESCC(C)ON(CC(=O)NO)S(=O)(=O)c1ccc(Br)s1