Reaction Details
TargetSerum paraoxonase/arylesterase 1
LigandBDBM50139137
Substrate/Competitorn/a
Meas. Tech.ChEBML_1552279
IC50 6370±n/a nM
Citation Karatas, MOUslu, HAlici, BGökçe, BGencer, NArslan, OArslan, NBÖzdemir, N Functionalized imidazolium and benzimidazolium salts as paraoxonase 1 inhibitors: Synthesis, characterization and molecular docking studies. Bioorg Med Chem24:1392-401 (2016) 
 
Serum paraoxonase/arylesterase 1
Name:Serum paraoxonase/arylesterase 1
Type:Enzyme
Mol. Mass.:39719.73
Organism:Homo sapiens (Human)
Description:P27169
Residue:355
BDBM50139137
NameBDBM50139137
Synonyms:CHEMBL3759162
TypeSmall organic molecule
Emp. Form.C19H23ClN2O2
Mol. Mass.346.851
SMILES[Cl-].CCCCn1cc[n+](Cc2cc(=O)oc3cc(C)cc(C)c23)c1