Reaction Details
TargetSerum paraoxonase/arylesterase 1
LigandBDBM50144691
Substrate/Competitorn/a
Meas. Tech.ChEMBL_1552279 (CHEMBL3761350)
IC50 627000±n/a nM
Citation Karatas, MOUslu, HAlici, BGökçe, BGencer, NArslan, OArslan, NBÖzdemir, N Functionalized imidazolium and benzimidazolium salts as paraoxonase 1 inhibitors: Synthesis, characterization and molecular docking studies. Bioorg Med Chem24:1392-401 (2016) 
 
Serum paraoxonase/arylesterase 1
Name:Serum paraoxonase/arylesterase 1
Type:Enzyme
Mol. Mass.:39719.73
Organism:Homo sapiens (Human)
Description:P27169
Residue:355
BDBM50144691
NameBDBM50144691
Synonyms:CHEMBL3759697
TypeSmall organic molecule
Emp. Form.C28H26ClN5O2
Mol. Mass.499.991
SMILES[Cl-].CC(C)(C)c1ccc2oc(=O)cc(C[n+]3cn(Cn4nnc5ccccc45)c4ccccc34)c2c1