Reaction Details
TargetLysine-specific histone demethylase 2
LigandBDBM50140043
Substrate/Competitorn/a
Meas. Tech.ChEBML_1554333
IC50 230000±n/a nM
Citation Kakizawa, TMizukami, TItoh, YHasegawa, MSasaki, RSuzuki, T Evaluation of phenylcyclopropylamine compounds by enzymatic assay of lysine-specific demethylase 2 in the presence of NPAC peptide. Bioorg Med Chem Lett26:1193-5 (2016) 
 
Lysine-specific histone demethylase 2
Name:Lysine-specific histone demethylase 2
Type:PROTEIN
Mol. Mass.:92112.91
Organism:Homo sapiens (Human)
Description:ChEMBL_992590
Residue:822
BDBM50140043
NameBDBM50140043
Synonyms:CHEMBL3765529
TypeSmall organic molecule
Emp. Form.C35H37N3O2
Mol. Mass.531.6872
SMILESO=C(NCc1ccccc1)[C@H](CCCCNC1CC1c1ccccc1)NC(=O)c1ccc(cc1)-c1ccccc1