Reaction Details
TargetExtracellular calcium-sensing receptor
LigandBDBM50140175
Substrate/Competitorn/a
Meas. Tech.ChEMBL_1547654 (CHEMBL3755705)
EC50 135±n/a nM
Citation Kiefer, LBeaumard, FGorojankina, TFaure, HRuat, MDodd, RH Design and synthesis of calindol derivatives as potent and selective calcium sensing receptor agonists. Bioorg Med Chem24:554-69 (2016) 
 
Extracellular calcium-sensing receptor
Name:Extracellular calcium-sensing receptor
Type:PROTEIN
Mol. Mass.:120858.46
Organism:Rattus norvegicus
Description:ChEMBL_750426
Residue:1079
BDBM50140175
NameBDBM50140175
Synonyms:CHEMBL3753729
TypeSmall organic molecule
Emp. Form.C27H24N2
Mol. Mass.376.4929
SMILESC[C@@H](NCc1cc2c(cccc2[nH]1)-c1ccccc1)c1cccc2ccccc12