Reaction Details
TargetKinesin-like protein KIF20A
LigandBDBM50140926
Substrate/Competitorn/a
Meas. Tech.ChEMBL_1548834 (CHEMBL3755390)
IC50 10100±n/a nM
Citation Labrière, CTalapatra, SKThoret, SBougeret, CKozielski, FGuillou, C New MKLP-2 inhibitors in the paprotrain series: Design, synthesis and biological evaluations. Bioorg Med Chem24:721-34 (2016) 
 
Kinesin-like protein KIF20A
Name:Kinesin-like protein KIF20A
Type:PROTEIN
Mol. Mass.:100281.35
Organism:Homo sapiens (Human)
Description:ChEMBL_104520
Residue:890
BDBM50140926
NameBDBM50140926
Synonyms:CHEMBL3752869
TypeSmall organic molecule
Emp. Form.C17H11ClN2
Mol. Mass.278.736
SMILESClc1ccc(\C=C(/C#N)c2c[nH]c3ccccc23)cc1