Reaction Details
TargetKinesin-like protein KIF20A
LigandBDBM50140930
Substrate/Competitorn/a
Meas. Tech.ChEMBL_1548834 (CHEMBL3755390)
IC50 5600±n/a nM
Citation Labrière, CTalapatra, SKThoret, SBougeret, CKozielski, FGuillou, C New MKLP-2 inhibitors in the paprotrain series: Design, synthesis and biological evaluations. Bioorg Med Chem24:721-34 (2016) 
 
Kinesin-like protein KIF20A
Name:Kinesin-like protein KIF20A
Type:PROTEIN
Mol. Mass.:100281.35
Organism:Homo sapiens (Human)
Description:ChEMBL_104520
Residue:890
BDBM50140930
NameBDBM50140930
Synonyms:CHEMBL3753970
TypeSmall organic molecule
Emp. Form.C17H13N3O
Mol. Mass.275.3046
SMILESCOc1ccc2c(c[nH]c2c1)C(=C\c1cccnc1)\C#N