Reaction Details
TargetKinesin-like protein KIF20A
LigandBDBM50140935
Substrate/Competitorn/a
Meas. Tech.ChEMBL_1548836 (CHEMBL3755392)
IC50 1300±n/a nM
Citation Labrière, CTalapatra, SKThoret, SBougeret, CKozielski, FGuillou, C New MKLP-2 inhibitors in the paprotrain series: Design, synthesis and biological evaluations. Bioorg Med Chem24:721-34 (2016) 
 
Kinesin-like protein KIF20A
Name:Kinesin-like protein KIF20A
Type:PROTEIN
Mol. Mass.:100281.35
Organism:Homo sapiens (Human)
Description:ChEMBL_104520
Residue:890
BDBM50140935
NameBDBM50140935
Synonyms:CHEMBL3753380
TypeSmall organic molecule
Emp. Form.C23H17N3O
Mol. Mass.351.4006
SMILESN#C\C(=C/c1cccnc1)c1c[nH]c2ccc(OCc3ccccc3)cc12