Reaction Details
TargetMu-type opioid receptor
LigandBDBM50142704
Substrate/Competitorn/a
Meas. Tech.ChEMBL_1552642 (CHEMBL3762581)
Ki 3.3±n/a nM
Citation Turnaturi, RAricò, GRonsisvalle, GParenti, CPasquinucci, L Multitarget opioid ligands in pain relief: New players in an old game. Eur J Med Chem108:211-28 (2016) 
 
Mu-type opioid receptor
Name:Mu-type opioid receptor
Type:G Protein-Coupled Receptor (GPCR)
Mol. Mass.:44789.51
Organism:Homo sapiens (Human)
Description:P35372
Residue:400
BDBM50142704
NameBDBM50142704
Synonyms:CHEMBL3758563
TypeSmall organic molecule
Emp. Form.C32H36N4O4
Mol. Mass.540.6526
SMILESCc1cc(O)cc(C)c1C[C@H](N)C(=O)N1Cc2ccccc2C[C@@H]1C(=O)NCC(=O)N1CCc2ccccc2C1