Reaction Details
TargetMu-type opioid receptor
LigandBDBM50143182
Substrate/Competitorn/a
Meas. Tech.ChEMBL_1550875 (CHEMBL3762660)
EC50 5.6±n/a nM
Citation Perlikowska, RPiekielna, JGentilucci, LDe Marco, RCerlesi, MCCalo, GArtali, RTömböly, CKluczyk, AJanecka, A Synthesis of mixed MOR/KOR efficacy cyclic opioid peptide analogs with antinociceptive activity after systemic administration. Eur J Med Chem109:276-86 (2016) 
 
Mu-type opioid receptor
Name:Mu-type opioid receptor
Type:G Protein-Coupled Receptor (GPCR)
Mol. Mass.:44789.51
Organism:Homo sapiens (Human)
Description:P35372
Residue:400
BDBM50143182
NameBDBM50143182
Synonyms:CHEMBL3759167
TypeSmall organic molecule
Emp. Form.C43H51N7O7
Mol. Mass.777.9077
SMILESCc1cc(O)cc(C)c1C[C@H](N)C(=O)N[C@@H]1CCCCNC(=O)C[C@H](NC(=O)[C@@H](Cc2cccc3ccccc23)NC(=O)[C@H](Cc2ccccc2)NC1=O)C(N)=O