Reaction Details
TargetSphingosine 1-phosphate receptor 2
LigandBDBM50143206
Substrate/Competitorn/a
Meas. Tech.ChEMBL_1550899 (CHEMBL3762854)
IC50 8.8±n/a nM
Citation Kusumi, KShinozaki, KYamaura, YHashimoto, AKurata, HNaganawa, AOtsuki, KMatsushita, TSekiguchi, TKakuuchi, AYamamoto, HSeko, T Discovery of novel S1P2 antagonists, part 3: Improving the oral bioavailability of a series of 1,3-bis(aryloxy)benzene derivatives. Bioorg Med Chem Lett26:1209-13 (2016) 
 
Sphingosine 1-phosphate receptor 2
Name:Sphingosine 1-phosphate receptor 2
Type:G Protein-Coupled Receptor (GPCR)
Mol. Mass.:38883.16
Organism:Homo sapiens (Human)
Description:Membranes isolated from S1P2-transfected CHO cells were used in ligand binding assay.
Residue:353
BDBM50143206
NameBDBM50143206
Synonyms:CHEMBL3759532
TypeSmall organic molecule
Emp. Form.C32H35FN2O6
Mol. Mass.562.6285
SMILESCC(C)(C(O)=O)c1ccc(Oc2cc(NC(=O)N3CCC(O)(C3)C3CCCC3)cc(Oc3ccc(F)cc3)c2)cc1