Reaction Details
TargetMetabotropic glutamate receptor 5
LigandBDBM50443085
Substrate/Competitorn/a
Meas. Tech.ChEMBL_1552218 (CHEMBL3761220)
Ki 5.6±n/a nM
Citation Topiol, SSabio, M 7TM X-ray structures for class C GPCRs as new drug-discovery tools. 1. mGluR5. Bioorg Med Chem Lett26:484-94 (2016) 
 
Metabotropic glutamate receptor 5
Name:Metabotropic glutamate receptor 5
Type:Enzyme
Mol. Mass.:132484.72
Organism:Homo sapiens (Human)
Description:n/a
Residue:1212
BDBM50443085
NameBDBM50443085
Synonyms:AFQ056 | Mavoglurant
TypeSmall organic molecule
Emp. Form.C19H23NO3
Mol. Mass.313.3908
SMILESCOC(=O)N1CC[C@@H]2[C@H]1CCC[C@@]2(O)C#Cc1cccc(C)c1