Reaction Details
TargetCarbonic anhydrase 2
LigandBDBM50143813
Substrate/Competitorn/a
Meas. Tech.ChEMBL_1551184 (CHEMBL3761632)
Ki 0.980000±n/a nM
Citation Yaseen, REkinci, DSenturk, MHameed, ADOvais, SRathore, PSamim, MJaved, KSupuran, CT Pyridazinone substituted benzenesulfonamides as potent carbonic anhydrase inhibitors. Bioorg Med Chem Lett26:1337-41 (2016) 
 
Carbonic anhydrase 2
Name:Carbonic anhydrase 2
Type:Enzyme
Mol. Mass.:29250.71
Organism:Homo sapiens (Human)
Description:P00918
Residue:260
BDBM50143813
NameBDBM50143813
Synonyms:CHEMBL3759894
TypeSmall organic molecule
Emp. Form.C22H23N3O3S
Mol. Mass.409.501
SMILESNS(=O)(=O)c1ccc(cc1)-n1nc(ccc1=O)-c1ccc(cc1)C1CCCCC1