Reaction Details
TargetDiacylglycerol O-acyltransferase 1
LigandBDBM50143817
Substrate/Competitorn/a
Meas. Tech.ChEMBL_1551188 (CHEMBL3761636)
IC50 7.0±n/a nM
Citation Nakajima, KApril, MBrewer, JTDaniels, TForster, CJGilmore, TAJain, MKanter, AKwak, YLi, JMcQuire, LSerrano-Wu, MHStreeper, RSzklennik, PThompson, JWang, B Discovery of diamide compounds as diacylglycerol acyltransferase 1 (DGAT1) inhibitors. Bioorg Med Chem Lett26:1245-8 (2016) 
 
Diacylglycerol O-acyltransferase 1
Name:Diacylglycerol O-acyltransferase 1
Type:Protein
Mol. Mass.:55297.82
Organism:Homo sapiens (Human)
Description:O75907
Residue:488
BDBM50143817
NameBDBM50143817
Synonyms:CHEMBL3758618
TypeSmall organic molecule
Emp. Form.C31H48N2O6
Mol. Mass.544.7226
SMILESCC(C)C[C@H](OC(=O)C(C)(C)C)C(=O)NC1(CCCC1)C(=O)N[C@@H](CCc1ccccc1)C(=O)OC(C)(C)C