Reaction Details
TargetCarbonic anhydrase 12
LigandBDBM50334349
Substrate/Competitorn/a
Meas. Tech.ChEMBL_1551387 (CHEMBL3762508)
Ki 5.7±n/a nM
Citation Lomelino, CLMahon, BPMcKenna, RCarta, FSupuran, CT Kinetic and X-ray crystallographic investigations on carbonic anhydrase isoforms I, II, IX and XII of a thioureido analog of SLC-0111. Bioorg Med Chem24:976-81 (2016) 
 
Carbonic anhydrase 12
Name:Carbonic anhydrase 12
Type:Enzyme
Mol. Mass.:39456.00
Organism:Homo sapiens (Human)
Description:Catalytic domain of human cloned isozyme was used in the assay
Residue:354
BDBM50334349
NameBDBM50334349
Synonyms:4-(3-(3-nitrophenyl)ureido)benzenesulfonamide 4-{[(3-nitrophenyl)carbamoyl]amino}benzenesulfonamide CHEMBL1614844
TypeSmall organic molecule
Emp. Form.C13H12N4O5S
Mol. Mass.336.323
SMILESNS(=O)(=O)c1ccc(NC(=O)Nc2cccc(c2)[N+]([O-])=O)cc1