Reaction Details
TargetPalmitoleoyl-protein carboxylesterase NOTUM
LigandBDBM50144499
Substrate/Competitorn/a
Meas. Tech.ChEMBL_1551505 (CHEMBL3762926)
EC50 175±n/a nM
Citation Han, QPabba, PKBarbosa, JMabon, RHealy, JPGardyan, MWTerranova, KMBrommage, RThompson, AYSchmidt, JMWilson, AGXu, XTarver, JECarson, KG 4H-Thieno[3,2-c]chromene based inhibitors of Notum Pectinacetylesterase. Bioorg Med Chem Lett26:1184-7 (2016) 
 
Palmitoleoyl-protein carboxylesterase NOTUM
Name:Palmitoleoyl-protein carboxylesterase NOTUM
Type:PROTEIN
Mol. Mass.:56587.82
Organism:Mus musculus
Description:ChEMBL_116720
Residue:503
BDBM50144499
NameBDBM50144499
Synonyms:CHEMBL3759300
TypeSmall organic molecule
Emp. Form.C12H7FO3S
Mol. Mass.250.246
SMILESOC(=O)c1cc2COc3ccc(F)cc3-c2s1