Reaction Details
TargetPalmitoleoyl-protein carboxylesterase NOTUM
LigandBDBM50144541
Substrate/Competitorn/a
Meas. Tech.ChEMBL_1551504 (CHEMBL3762925)
EC50 461±n/a nM
Citation Han, QPabba, PKBarbosa, JMabon, RHealy, JPGardyan, MWTerranova, KMBrommage, RThompson, AYSchmidt, JMWilson, AGXu, XTarver, JECarson, KG 4H-Thieno[3,2-c]chromene based inhibitors of Notum Pectinacetylesterase. Bioorg Med Chem Lett26:1184-7 (2016) 
 
Palmitoleoyl-protein carboxylesterase NOTUM
Name:Palmitoleoyl-protein carboxylesterase NOTUM
Type:PROTEIN
Mol. Mass.:55706.36
Organism:Homo sapiens (Human)
Description:ChEMBL_116492
Residue:496
BDBM50144541
NameBDBM50144541
Synonyms:CHEMBL3759068
TypeSmall organic molecule
Emp. Form.C12H8O2S2
Mol. Mass.248.321
SMILESOC(=O)c1cc2CSc3ccccc3-c2s1