Reaction Details
TargetPalmitoleoyl-protein carboxylesterase NOTUM
LigandBDBM50144573
Substrate/Competitorn/a
Meas. Tech.ChEMBL_1551505 (CHEMBL3762926)
EC50 36±n/a nM
Citation Han, QPabba, PKBarbosa, JMabon, RHealy, JPGardyan, MWTerranova, KMBrommage, RThompson, AYSchmidt, JMWilson, AGXu, XTarver, JECarson, KG 4H-Thieno[3,2-c]chromene based inhibitors of Notum Pectinacetylesterase. Bioorg Med Chem Lett26:1184-7 (2016) 
 
Palmitoleoyl-protein carboxylesterase NOTUM
Name:Palmitoleoyl-protein carboxylesterase NOTUM
Type:PROTEIN
Mol. Mass.:56587.82
Organism:Mus musculus
Description:ChEMBL_116720
Residue:503
BDBM50144573
NameBDBM50144573
Synonyms:CHEMBL3759035
TypeSmall organic molecule
Emp. Form.C15H11NO3S
Mol. Mass.285.318
SMILESCOc1ccc2-c3sc(cc3CCc2c1C#N)C(O)=O