Reaction Details
TargetPoly [ADP-ribose] polymerase 1
LigandBDBM50446130
Substrate/Competitorn/a
Meas. Tech.ChEMBL_1553353 (CHEMBL3767923)
IC50 2.0±n/a nM
Citation Wang, BChu, DFeng, YShen, YAoyagi-Scharber, MPost, LE Discovery and Characterization of (8S,9R)-5-Fluoro-8-(4-fluorophenyl)-9-(1-methyl-1H-1,2,4-triazol-5-yl)-2,7,8,9-tetrahydro-3H-pyrido[4,3,2-de]phthalazin-3-one (BMN 673, Talazoparib), a Novel, Highly Potent, and Orally Efficacious Poly(ADP-ribose) Polymerase-1/2 Inhibitor, as an Anticancer Agent. J Med Chem59:335-57 (2016) 
 
Poly [ADP-ribose] polymerase 1
Name:Poly [ADP-ribose] polymerase 1
Type:n/a
Mol. Mass.:113114.22
Organism:Homo sapiens (Human)
Description:P09874
Residue:1014
BDBM50446130
NameBDBM50446130
Synonyms:AG-014699 RUCAPARIB CAMSYLATE | Rucaparib
TypeSmall organic molecule
Emp. Form.C19H18FN3O
Mol. Mass.323.3641
SMILESCNCc1ccc(cc1)-c1[nH]c2cc(F)cc3C(=O)NCCc1c23