Reaction Details
TargetType-2 angiotensin II receptor
LigandBDBM50199326
Substrate/Competitorn/a
Meas. Tech.ChEMBL_1555129 (CHEMBL3768051)
Ki 0.700000±n/a nM
Citation Sallander, JWallinder, CHallberg, AÅqvist, JGutiérrez-de-Terán, H Structural determinants of subtype selectivity and functional activity of angiotensin II receptors. Bioorg Med Chem Lett26:1355-9 (2016) 
 
Type-2 angiotensin II receptor
Name:Type-2 angiotensin II receptor
Type:Enzyme Catalytic Domain
Mol. Mass.:41201.61
Organism:Homo sapiens (Human)
Description:Angiotensin II, central 0 0::P50052
Residue:363
BDBM50199326
NameBDBM50199326
Synonyms:CHEMBL217673 | N-butyloxycarbonyl-2-(4-imidazol-1-ylmethylphenyl)-4-iso-butylbenzenesulfonamide
TypeSmall organic molecule
Emp. Form.C25H31N3O4S
Mol. Mass.469.596
SMILESCCCCOC(=O)NS(=O)(=O)c1ccc(CC(C)C)cc1-c1ccc(Cn2ccnc2)cc1