Reaction Details
TargetAndrogen receptor
LigandBDBM50367916
Substrate/Competitorn/a
Meas. Tech.ChEMBL_1553957 (CHEMBL3767969)
EC50 0.013000±n/a nM
Citation Saeed, AVaught, GMGavardinas, KMatthews, DGreen, JELosada, PGBullock, HACalvert, NAPatel, NJSweetana, SAKrishnan, VHenck, JWLuz, JGWang, YJadhav, P 2-Chloro-4-[[(1R,2R)-2-hydroxy-2-methyl-cyclopentyl]amino]-3-methyl-benzonitrile: A Transdermal Selective Androgen Receptor Modulator (SARM) for Muscle Atrophy. J Med Chem59:750-5 (2016) 
 
Androgen receptor
Name:Androgen receptor
Type:Receptor
Mol. Mass.:99185.27
Organism:Homo sapiens (Human)
Description:CHO cells were stably transfected with human AR gene.
Residue:920
BDBM50367916
NameBDBM50367916
Synonyms:METHYLTRIENOLONE R-1881
TypeSmall organic molecule
Emp. Form.C19H24O2
Mol. Mass.284.3927
SMILESC[C@]1(O)CC[C@H]2[C@@H]3CCC4=CC(=O)CCC4=C3C=C[C@]12C