Reaction Details
TargetGlucocorticoid receptor
LigandBDBM50145863
Substrate/Competitorn/a
Meas. Tech.ChEMBL_1553954 (CHEMBL3767966)
Ki>6020±n/a nM
Citation Saeed, AVaught, GMGavardinas, KMatthews, DGreen, JELosada, PGBullock, HACalvert, NAPatel, NJSweetana, SAKrishnan, VHenck, JWLuz, JGWang, YJadhav, P 2-Chloro-4-[[(1R,2R)-2-hydroxy-2-methyl-cyclopentyl]amino]-3-methyl-benzonitrile: A Transdermal Selective Androgen Receptor Modulator (SARM) for Muscle Atrophy. J Med Chem59:750-5 (2016) 
 
Glucocorticoid receptor
Name:Glucocorticoid receptor
Type:Enzyme
Mol. Mass.:85656.87
Organism:Homo sapiens (Human)
Description:P04150
Residue:777
BDBM50145863
NameBDBM50145863
Synonyms:CHEMBL3764185
TypeSmall organic molecule
Emp. Form.C14H17ClN2O
Mol. Mass.264.751
SMILESCc1c(N[C@@H]2CCC[C@@]2(C)O)ccc(C#N)c1Cl