Reaction Details
TargetNon-receptor tyrosine-protein kinase TYK2
LigandBDBM50146031
Substrate/Competitorn/a
Meas. Tech.ChEMBL_1554263 (CHEMBL3766477)
IC50 1.5±n/a nM
Citation Yogo, TNagamiya, HSeto, MSasaki, SShih-Chung, HOhba, YTokunaga, NLee, GNRhim, CYYoon, CHCho, SYSkene, RYamamoto, SSatou, YKuno, MMiyazaki, TNakagawa, HOkabe, AMarui, SAso, KYoshida, M Structure-Based Design and Synthesis of 3-Amino-1,5-dihydro-4H-pyrazolopyridin-4-one Derivatives as Tyrosine Kinase 2 Inhibitors. J Med Chem59:733-49 (2016) 
 
Non-receptor tyrosine-protein kinase TYK2
Name:Non-receptor tyrosine-protein kinase TYK2
Type:Protein
Mol. Mass.:133666.03
Organism:Homo sapiens (Human)
Description:P29597
Residue:1187
BDBM50146031
NameBDBM50146031
Synonyms:CHEMBL3763252
TypeSmall organic molecule
Emp. Form.C20H26N6O2
Mol. Mass.382.4594
SMILESCC(C)C(C)n1cc(-c2ccc(cn2)N2CCOCC2)c2[nH]nc(N)c2c1=O