Reaction Details
TargetNon-receptor tyrosine-protein kinase TYK2/Tyrosine-protein kinase JAK1
LigandBDBM50146024
Substrate/Competitorn/a
Meas. Tech.ChEMBL_1554278 (CHEMBL3766666)
IC50 65±n/a nM
Citation Yogo, TNagamiya, HSeto, MSasaki, SShih-Chung, HOhba, YTokunaga, NLee, GNRhim, CYYoon, CHCho, SYSkene, RYamamoto, SSatou, YKuno, MMiyazaki, TNakagawa, HOkabe, AMarui, SAso, KYoshida, M Structure-Based Design and Synthesis of 3-Amino-1,5-dihydro-4H-pyrazolopyridin-4-one Derivatives as Tyrosine Kinase 2 Inhibitors. J Med Chem59:733-49 (2016) 
 
Non-receptor tyrosine-protein kinase TYK2/Tyrosine-protein kinase JAK1
Name:Non-receptor tyrosine-protein kinase TYK2/Tyrosine-protein kinase JAK1
Synonyms:JAK1/TYK2
Type:n/a
Mol. Mass.:n/a
Description:ASSAY_ID of ChEMBL is 1368159
Components:This complex has 2 components.
Component 1
Name:Tyrosine-protein kinase JAK1
Type:Protein
Mol. Mass.:133293.73
Organism:Homo sapiens (Human)
Description:P23458
Residue:1154
Component 2
Name:Non-receptor tyrosine-protein kinase TYK2
Synonyms:Non-receptor tyrosine-protein kinase TYK2 (TYK2) TYK2_HUMAN | Tyrosine-protein kinase TYK2
Type:Protein
Mol. Mass.:133666.03
Organism:Homo sapiens (Human)
Description:P29597
Residue:1187
BDBM50146024
NameBDBM50146024
Synonyms:CHEMBL3765822
TypeSmall organic molecule
Emp. Form.C18H26N6O2
Mol. Mass.358.438
SMILESCC(C)[C@@H](C)n1cc(-c2cc(n(C)n2)C(C)(C)O)c2[nH]nc(N)c2c1=O