Reaction Details
TargetNon-receptor tyrosine-protein kinase TYK2/Tyrosine-protein kinase JAK2
LigandBDBM50021656
Substrate/Competitorn/a
Meas. Tech.ChEMBL_1554270 (CHEMBL3766658)
IC50 200±n/a nM
Citation Yogo, TNagamiya, HSeto, MSasaki, SShih-Chung, HOhba, YTokunaga, NLee, GNRhim, CYYoon, CHCho, SYSkene, RYamamoto, SSatou, YKuno, MMiyazaki, TNakagawa, HOkabe, AMarui, SAso, KYoshida, M Structure-Based Design and Synthesis of 3-Amino-1,5-dihydro-4H-pyrazolopyridin-4-one Derivatives as Tyrosine Kinase 2 Inhibitors. J Med Chem59:733-49 (2016) 
 
Non-receptor tyrosine-protein kinase TYK2/Tyrosine-protein kinase JAK2
Name:Non-receptor tyrosine-protein kinase TYK2/Tyrosine-protein kinase JAK2
Synonyms:JAK2/TYK2
Type:n/a
Mol. Mass.:n/a
Description:ASSAY_ID of ChEMBL is 1368160
Components:This complex has 2 components.
Component 1
Name:Tyrosine-protein kinase JAK2
Type:Protein
Mol. Mass.:130684.68
Organism:Homo sapiens (Human)
Description:O60674
Residue:1132
Component 2
Name:Non-receptor tyrosine-protein kinase TYK2
Synonyms:Non-receptor tyrosine-protein kinase TYK2 (TYK2) TYK2_HUMAN | Tyrosine-protein kinase TYK2
Type:Protein
Mol. Mass.:133666.03
Organism:Homo sapiens (Human)
Description:P29597
Residue:1187
BDBM50021656
NameBDBM50021656
Synonyms:BARICITINIB LY-3009104 US10766894, Compound TABLE 1.19 US11203595, TABLE 1.19 US20230416237, Example baricitinib
TypeSmall organic molecule
Emp. Form.C16H17N7O2S
Mol. Mass.371.417
SMILESCCS(=O)(=O)N1CC(CC#N)(C1)n1cc(cn1)-c1ncnc2[nH]ccc12