Reaction Details
TargetDiacylglycerol lipase-alpha
LigandBDBM50148193
Substrate/Competitorn/a
Meas. Tech.ChEMBL_1553495 (CHEMBL3768666)
IC50 3±n/a nM
Citation Chupak, LSZheng, XHu, SHuang, YDing, MLewis, MAWestphal, RSBlat, YMcClure, AGentles, RG Structure activity relationship studies on chemically non-reactive glycine sulfonamide inhibitors of diacylglycerol lipase. Bioorg Med Chem24:1455-68 (2016) 
 
Diacylglycerol lipase-alpha
Name:Diacylglycerol lipase-alpha
Type:PROTEIN
Mol. Mass.:114947.74
Organism:Homo sapiens (Human)
Description:ChEMBL_1449471
Residue:1042
BDBM50148193
NameBDBM50148193
Synonyms:CHEMBL3765716
TypeSmall organic molecule
Emp. Form.C26H25Cl2NO5S
Mol. Mass.534.451
SMILESCC1(C)CCc2cc(ccc2O1)S(=O)(=O)N(CC(O)=O)Cc1ccc(cc1)-c1cc(Cl)cc(Cl)c1